{"text_format":"1","workbook":"xlsx","n_sheets":5,"sheets":["入力上の注意","申込①","申込②","List","一覧"],"not_rendered":{"charts":0,"images":0,"macros":1,"external_links":0,"defined_names":2,"comments":0,"pivot_tables":0},"unopened":[],"bounds":{"document_bytes":16777216,"sheet_cells":100000,"rows_first":2000,"rows_last":500,"rows_between":2000,"halvings":0,"cell_chars":16384,"cell_head_chars":4096},"cells_cut":0,"cells_raw":0,"read":"whole","date_system":"1900"}

{"sheet":"入力上の注意","index":0,"n_rows":48,"n_cols":16,"rows_kept":48,"cut":false,"hidden":false,"merged":[[35,4,38,10],[47,3,47,16],[19,1,20,1],[19,5,20,5],[19,6,20,6],[19,7,20,7],[19,8,20,8],[19,9,20,9],[19,10,20,10],[19,11,20,11],[19,12,20,12],[19,13,20,13],[19,14,20,14],[19,15,20,15],[30,3,30,4],[31,3,31,4],[9,12,9,13],[9,14,9,15],[10,3,10,4],[10,7,10,8],[11,1,12,1],[11,5,12,5],[11,6,12,6],[11,7,12,7],[11,8,12,8],[9,1,10,1],[9,3,9,4],[9,5,10,5],[9,6,10,6],[9,7,9,8],[9,9,10,9],[11,15,12,15],[11,9,12,9],[11,10,12,10],[11,11,12,11],[13,1,14,1],[13,5,14,5],[13,6,14,6],[13,7,14,7],[13,8,14,8],[11,12,12,12],[11,13,12,13],[11,14,12,14],[13,12,14,12],[13,13,14,13],[13,14,14,14],[13,15,14,15],[15,1,16,1],[15,5,16,5],[15,6,16,6],[15,7,16,7],[15,8,16,8],[15,15,16,15],[15,12,16,12],[15,13,16,13],[15,14,16,14],[13,9,14,9],[13,10,14,10],[13,11,14,11],[15,9,16,9],[15,10,16,10],[15,11,16,11],[17,1,18,1],[17,5,18,5],[17,6,18,6],[17,7,18,7],[17,8,18,8],[17,12,18,12],[17,13,18,13],[17,14,18,14],[17,15,18,15],[23,2,23,4],[23,5,23,9],[23,10,23,15],[17,9,18,9],[17,10,18,10],[17,11,18,11],[31,10,31,11],[31,13,31,15],[24,2,24,4],[24,5,24,9],[24,10,24,15],[25,8,25,13],[26,8,26,13],[28,5,28,7],[29,10,29,11],[27,11,27,13]]}
[]
[null,"この申込書は，保険の申込一覧を兼ねていますので合宿に参加する試合に出る生徒，合宿だけ参加する生徒，監督，コーチ，指導者"]
[null,"の名前，生年月日などをすべて一覧に入力してください"]
[null,"（注意）"]
[null,"・例えば，青木 豊が新宮レスリング俱楽部と新宮高校に所属し合宿参加する場合は，下記のように備考に入力してください（2023年～変更）"]
[null,"　 代表者が，合宿に来れない場合は一覧表には入力しませんが　下の代表者名には入力・押印が必要"]
[null,"　 合宿に参加する監督・コーチなどが，新宮レスリング倶楽部と新宮高校の両方で指導する場合は両方に入力してください　備考も入力を"]
[]
[null,"（公財）日本レスリング協会　会長　富山 英明　様"]
[null,"No","協会","なまえ（ひらがな）",null,"学年","性別","生年月日",null,"所属","試合","U15","U17",null,"U20"]
{"$rows_left_out":39}
{"sheet":"申込①","index":1,"n_rows":53,"n_cols":56,"rows_kept":53,"cut":false,"hidden":false,"merged":[[32,10,32,16],[31,18,34,24],[27,9,27,17],[28,9,28,17],[30,7,30,16],[31,7,31,16],[12,0,13,0],[12,4,13,4],[12,5,13,5],[12,12,13,12],[14,7,15,7],[14,8,15,8],[14,9,15,9],[14,10,15,10],[14,0,15,0],[14,4,15,4],[14,5,15,5],[14,6,15,6],[16,0,17,0],[16,4,17,4],[16,5,17,5],[16,6,17,6],[16,7,17,7],[16,8,17,8],[12,6,13,6],[12,8,13,8],[12,9,13,9],[12,10,13,10],[12,11,13,11],[12,7,13,7],[10,9,11,9],[10,10,11,10],[10,11,11,11],[10,12,11,12],[10,7,11,7],[10,8,11,8],[6,0,7,0],[6,8,7,8],[6,4,7,4],[6,5,7,5],[8,9,9,9],[8,10,9,10],[8,0,9,0],[8,8,9,8],[8,4,9,4],[8,5,9,5],[8,6,9,6],[8,7,9,7],[6,7,7,7],[6,9,7,9],[6,10,7,10],[10,0,11,0],[10,4,11,4],[10,5,11,5],[10,6,11,6],[2,13,2,14],[4,9,5,9],[4,10,5,10],[4,11,5,11],[6,6,7,6],[0,43,0,44],[1,43,1,44],[8,11,9,11],[8,12,9,12],[8,14,9,14],[6,13,7,13],[6,14,7,14],[6,11,7,11],[6,12,7,12],[8,13,9,13],[4,13,5,13],[4,14,5,14],[6,15,7,15],[6,19,7,19],[6,20,7,20],[6,21,7,21],[6,29,7,29],[6,25,7,25],[6,24,7,24],[2,0,3,0],[2,2,2,3],[3,2,3,3],[2,8,3,8],[2,4,3,4],[2,5,3,5],[2,11,2,12],[4,0,5,0],[4,8,5,8],[4,4,5,4],[4,5,5,5],[4,12,5,12],[4,6,5,6],[2,6,2,7],[3,6,3,7],[4,7,5,7],[16,9,17,9],[16,10,17,10],[20,4,21,4],[18,0,19,0],[18,4,19,4],[18,5,19,5],[18,6,19,6],[18,7,19,7],[18,8,19,8],[18,9,19,9],[18,10,19,10],[24,0,25,0],[24,4,25,4],[24,5,25,5],[18,11,19,11],[18,12,19,12],[18,13,19,13],[18,14,19,14],[20,13,21,13],[20,14,21,14],[22,0,23,0],[22,4,23,4],[22,5,23,5],[22,6,23,6],[22,7,23,7],[22,8,23,8],[22,9,23,9],[22,10,23,10],[22,11,23,11],[22,12,23,12],[20,7,21,7],[20,8,21,8],[20,9,21,9],[20,10,21,10],[20,0,21,0],[8,29,9,29],[10,22,11,22],[10,23,11,23],[8,26,9,26],[8,22,9,22],[14,24,15,24],[14,25,15,25],[14,26,15,26],[14,27,15,27],[10,29,11,29],[12,25,13,25],[12,26,13,26],[8,27,9,27],[8,23,9,23],[8,24,9,24],[8,25,9,25],[12,29,13,29],[14,28,15,28],[14,29,15,29],[6,26,7,26],[6,27,7,27],[6,28,7,28],[6,22,7,22],[6,23,7,23],[24,10,25,10],[14,12,15,12],[24,6,25,6],[24,7,25,7],[24,8,25,8],[24,9,25,9],[8,28,9,28],[14,14,15,14],[16,11,17,11],[16,12,17,12],[16,13,17,13],[16,14,17,14],[12,28,13,28],[10,24,11,24],[10,25,11,25],[10,26,11,26],[10,28,11,28],[10,15,11,15],[10,19,11,19],[27,1,27,3],[28,1,28,3],[27,4,27,8],[28,4,28,8],[18,26,19,26],[18,27,19,27],[8,15,9,15],[8,19,9,19],[8,20,9,20],[8,21,9,21],[20,5,21,5],[20,6,21,6],[22,13,23,13],[22,14,23,14],[20,11,21,11],[20,12,21,12],[14,11,15,11],[24,11,25,11],[24,12,25,12],[24,13,25,13],[24,14,25,14],[14,13,15,13],[12,15,13,15],[12,19,13,19],[12,20,13,20],[12,21,13,21],[12,22,13,22],[12,23,13,23],[12,24,13,24],[10,27,11,27],[10,20,11,20],[18,23,19,23],[18,24,19,24],[18,25,19,25],[16,27,17,27],[16,29,17,29],[14,15,15,15],[14,19,15,19],[14,20,15,20],[14,21,15,21],[14,22,15,22],[14,23,15,23],[16,15,17,15],[16,19,17,19],[16,20,17,20],[16,21,17,21],[16,22,17,22],[16,23,17,23],[16,24,17,24],[16,25,17,25],[16,26,17,26],[20,22,21,22],[20,23,21,23],[20,24,21,24],[20,25,21,25],[20,26,21,26],[20,27,21,27],[18,22,19,22],[18,15,19,15],[16,28,17,28],[0,0,0,29],[36,2,36,3],[36,9,36,10],[24,29,25,29],[24,22,25,22],[24,23,25,23],[24,24,25,24],[24,25,25,25],[34,12,34,14],[36,12,36,14],[34,9,34,10],[24,15,25,15],[24,19,25,19],[24,20,25,20],[24,21,25,21],[20,28,21,28],[20,29,21,29],[22,15,23,15],[4,22,5,22],[22,19,23,19],[22,20,23,20],[22,21,23,21],[2,15,3,15],[2,17,2,18],[4,24,5,24],[4,25,5,25],[2,19,3,19],[2,20,3,20],[2,21,2,22],[2,23,3,23],[2,26,2,27],[33,4,33,6],[2,28,2,29],[3,17,3,18],[3,21,3,22],[4,28,5,28],[4,29,5,29],[22,28,23,28],[22,29,23,29],[24,26,25,26],[24,27,25,27],[24,28,25,28],[18,28,19,28],[18,29,19,29],[20,15,21,15],[20,19,21,19],[20,20,21,20],[20,21,21,21],[35,2,35,3],[4,26,5,26],[4,27,5,27],[22,22,23,22],[22,23,23,23],[22,24,23,24],[22,25,23,25],[22,26,23,26],[22,27,23,27],[18,19,19,19],[18,20,19,20],[18,21,19,21],[10,21,11,21],[12,13,13,13],[12,14,13,14],[10,13,11,13],[10,14,11,14],[12,27,13,27],[4,15,5,15],[4,16,5,16],[4,19,5,19],[4,20,5,20],[4,21,5,21],[4,23,5,23]]}
["令和5年度NTS近畿ブロック研修会参加申込書（保険申込含む）兼　U15レスリングアジア選手権大会日本代表選考会ﾌﾞﾛｯｸ予選会参加申込書",null,null,null,null,null,null,null,null,null,null,null,null,null,null,null,null,null,null,null,null,null,null,null,null,null,null,null,null,null,null,null,null,null,null,null,null,null,null,null,null,null,null,"なまえ"]
["（公財）日本レスリング協会　会長　富山 英明　様",null,null,null,null,null,null,null,null,null,null,null,null,null,null,null,null,null,null,null,null,null,null,null,"No",1,null,"No",1,null,null,null,null,null,null,null,null,null,null,null,null,null,null,"名前",null,"指"]
["No","協会","なまえ（ひらがな）",null,"学年\nなど","性別","生年月日",null,"所属","試合","U15","U17",null,"U20",null,"No","協会","なまえ（ひらがな）",null,"学年","性別","生年月日",null,"所属","試合","U15","U17",null,"U20",null,null,null,null,null,null,null,null,null,null,null,null,null,null,5,6,"監督",null,null,null,null,"U-15・F","U-17・F","U-17・G","U-20・F","U-20・G"]
[null,"番号","名前",null,null,null,"注) 2006/10/10の形で入力",null,null,"参加","フリー","フリー","グレコ","フリー","グレコ",null,"番号","名前",null,null,null,"注) 2006/10/10の形で入力",null,null,"参加","フリー","フリー","グレコ","フリー","グレコ",null,null,null,null,null,null,null,null,null,null,null,null,null,3,4,"コーチ",null,"高１","男","○",38,45,45,57,55,"和歌山県"]
["例","JWF23ー","しんぐう","たろう","高２","男","2006-10-10","生",null,"○",null,48,null,null,null,null,null,null,null,null,null,null,null,null,null,null,null,null,null,null,null,null,null,null,null,null,null,null,null,null,null,null,null,"学年",13,"高",null,"高２","女",null,41,48,48,61,60,"兵庫県"]
[null,123,"新宮","太朗",null,null,null,null,null,null,null,null,null,null,null,null,null,null,null,null,null,null,null,null,null,null,null,null,null,null,null,"U15F","U17F","U17G","U20F","U20G",null,null,9,"U15","U17","U20",null,"性別",7,"中",null,"高３",null,null,44,51,51,65,63,"奈良県"]
[1,"JWF23-",null,null,null,null,null,"生",null,null,null,null,null,null,null,11,"JWF23-",null,null,null,null,null,"生",null,null,null,null,null,null,null,null,{"$f":"IF(K7=\"\",\"\",$AF$6)","v":""},{"$f":"IF(L7=\"\",\"\",$AG$6)","v":""},{"$f":"IF(M7=\"\",\"\",$AH$6)","v":""},{"$f":"IF(N7=\"\",\"\",$AI$6)","v":""},{"$f":"IF(O7=\"\",\"\",$AJ$6)","v":""},{"$f":"AF7&AG7&AH7&AI7&AJ7","v":""},{"$f":"SUM(K7:O8)","v":0},null,null,null,null,null,"生年月日",8,"小",null,"中３",null,null,48,55,55,70,67,"大阪府"]
[null,null,null,null,null,null,null,null,null,null,null,null,null,null,null,null,null,null,null,null,null,null,null,null,null,null,null,null,null,null,null,null,null,null,null,null,null,null,{"$f":"IF(B7=\"\",\"\",VLOOKUP(B7,#REF!,$AM$6,FALSE))","v":{"$error":"#REF!"}},{"$f":"IF(AND(G7>=$AR$8,G7<=$AS$8),$AN$6,\"\")","v":""},{"$f":"IF(AND(G7>=$AR$9,G7<=$AS$9),$AO$6,\"\")","v":""},{"$f":"IF(AND(G7>=$AR$10,G7<=$AS$10),$AP$6,\"\")","v":""},"U15","2009-01-01","2011-12-31","H20",null,"中２",null,null,52,60,60,74,72,"京都府"]
[2,"JWF23-",null,null,null,null,null,"生",null,null,null,null,null,null,null,12,"JWF23-",null,null,null,null,null,"生",null,null,null,null,null,null,null,null,{"$f":"IF(K9=\"\",\"\",$AF$6)","v":""},{"$f":"IF(L9=\"\",\"\",$AG$6)","v":""},{"$f":"IF(M9=\"\",\"\",$AH$6)","v":""},{"$f":"IF(N9=\"\",\"\",$AI$6)","v":""},{"$f":"IF(O9=\"\",\"\",$AJ$6)","v":""},{"$f":"AF9&AG9&AH9&AI9&AJ9","v":""},{"$f":"SUM(K9:O10)","v":0},null,null,null,null,"U17","2007-01-01","2009-12-31","H18",null,"中１",null,null,57,65,65,79,77,"滋賀県"]
[null,null,null,null,null,null,null,null,null,null,null,null,null,null,null,null,null,null,null,null,null,null,null,null,null,null,null,null,null,null,null,null,null,null,null,null,null,null,{"$f":"IF(B9=\"\",\"\",VLOOKUP(B9,#REF!,$AM$6,FALSE))","v":{"$error":"#REF!"}},{"$f":"IF(AND(G9>=$AR$8,G9<=$AS$8),$AN$6,\"\")","v":""},{"$f":"IF(AND(G9>=$AR$9,G9<=$AS$9),$AO$6,\"\")","v":""},{"$f":"IF(AND(G9>=$AR$10,G9<=$AS$10),$AP$6,\"\")","v":""},"U20","2004-01-01","2007-12-31","H15",null,"小６",null,null,62,71,71,86,82]
{"$rows_left_out":44}
{"sheet":"申込②","index":2,"n_rows":47,"n_cols":56,"rows_kept":47,"cut":false,"hidden":false,"merged":[[0,43,0,44],[1,43,1,44],[2,0,3,0],[2,2,2,3],[2,4,3,4],[2,5,3,5],[2,6,2,7],[2,8,3,8],[2,11,2,12],[2,13,2,14],[3,2,3,3],[3,6,3,7],[2,15,3,15],[2,17,2,18],[2,19,3,19],[2,20,3,20],[2,21,2,22],[2,23,3,23],[2,26,2,27],[2,28,2,29],[3,17,3,18],[0,0,0,29],[3,21,3,22],[4,14,5,14],[6,0,7,0],[6,4,7,4],[6,5,7,5],[6,6,7,6],[6,7,7,7],[6,8,7,8],[6,9,7,9],[4,9,5,9],[4,10,5,10],[4,11,5,11],[4,12,5,12],[4,13,5,13],[6,10,7,10],[6,14,7,14],[6,11,7,11],[6,12,7,12],[6,13,7,13],[4,0,5,0],[4,4,5,4],[4,5,5,5],[4,6,5,6],[4,7,5,7],[4,8,5,8],[8,7,9,7],[8,8,9,8],[10,0,11,0],[8,0,9,0],[8,4,9,4],[8,5,9,5],[8,6,9,6],[8,14,9,14],[8,9,9,9],[8,10,9,10],[8,11,9,11],[10,10,11,10],[10,11,11,11],[10,12,11,12],[10,13,11,13],[8,13,9,13],[8,12,9,12],[10,9,11,9],[10,7,11,7],[10,8,11,8],[10,14,11,14],[10,4,11,4],[10,5,11,5],[10,6,11,6],[14,9,15,9],[14,10,15,10],[14,11,15,11],[16,12,17,12],[16,13,17,13],[12,10,13,10],[12,11,13,11],[12,12,13,12],[12,13,13,13],[16,9,17,9],[16,10,17,10],[16,11,17,11],[12,9,13,9],[12,0,13,0],[12,4,13,4],[12,5,13,5],[12,6,13,6],[12,7,13,7],[12,8,13,8],[16,0,17,0],[16,4,17,4],[16,5,17,5],[16,6,17,6],[16,7,17,7],[16,8,17,8],[14,7,15,7],[14,8,15,8],[14,0,15,0],[14,4,15,4],[14,5,15,5],[14,6,15,6],[18,0,19,0],[18,4,19,4],[18,5,19,5],[18,6,19,6],[18,7,19,7],[18,8,19,8],[18,9,19,9],[22,4,23,4],[22,5,23,5],[22,6,23,6],[20,14,21,14],[22,0,23,0],[20,10,21,10],[20,11,21,11],[22,14,23,14],[22,9,23,9],[22,10,23,10],[22,11,23,11],[22,12,23,12],[22,13,23,13],[20,12,21,12],[20,13,21,13],[24,0,25,0],[24,4,25,4],[24,5,25,5],[24,6,25,6],[24,7,25,7],[24,8,25,8],[24,9,25,9],[20,0,21,0],[20,4,21,4],[20,5,21,5],[20,6,21,6],[22,7,23,7],[22,8,23,8],[20,7,21,7],[20,8,21,8],[20,9,21,9],[10,25,11,25],[10,26,11,26],[16,19,17,19],[18,10,19,10],[18,11,19,11],[18,12,19,12],[12,15,13,15],[18,14,19,14],[12,24,13,24],[12,25,13,25],[12,26,13,26],[18,13,19,13],[14,12,15,12],[14,13,15,13],[14,14,15,14],[12,14,13,14],[16,14,17,14],[8,24,9,24],[6,15,7,15],[6,19,7,19],[6,20,7,20],[6,21,7,21],[8,25,9,25],[8,26,9,26],[8,27,9,27],[8,28,9,28],[8,15,9,15],[8,19,9,19],[8,20,9,20],[8,21,9,21],[8,22,9,22],[8,23,9,23],[6,22,7,22],[6,23,7,23],[6,27,7,27],[6,28,7,28],[6,24,7,24],[6,25,7,25],[6,26,7,26],[10,27,11,27],[10,28,11,28],[14,15,15,15],[14,19,15,19],[14,20,15,20],[14,21,15,21],[14,22,15,22],[14,23,15,23],[12,22,13,22],[12,23,13,23],[12,19,13,19],[12,20,13,20],[12,21,13,21],[14,24,15,24],[14,25,15,25],[14,26,15,26],[14,27,15,27],[10,15,11,15],[10,19,11,19],[10,20,11,20],[10,21,11,21],[10,22,11,22],[10,23,11,23],[10,24,11,24],[20,23,21,23],[18,22,19,22],[18,23,19,23],[16,25,17,25],[16,26,17,26],[16,27,17,27],[16,28,17,28],[18,15,19,15],[18,19,19,19],[18,20,19,20],[18,21,19,21],[18,27,19,27],[18,28,19,28],[18,24,19,24],[18,25,19,25],[18,26,19,26],[16,15,17,15],[16,20,17,20],[16,21,17,21],[16,22,17,22],[16,23,17,23],[16,24,17,24],[33,4,33,6],[35,2,35,3],[27,1,28,14],[24,15,25,15],[24,19,25,19],[24,20,25,20],[24,21,25,21],[24,27,25,27],[24,22,25,22],[24,23,25,23],[24,24,25,24],[24,25,25,25],[24,26,25,26],[24,10,25,10],[24,11,25,11],[24,12,25,12],[24,13,25,13],[24,14,25,14],[30,7,30,16],[31,7,31,16],[32,10,32,16],[34,9,34,10],[34,12,34,14],[4,15,5,15],[4,16,5,16],[4,19,5,19],[4,20,5,20],[4,21,5,21],[4,22,5,22],[4,23,5,23],[4,24,5,24],[24,28,25,28],[20,24,21,24],[22,27,23,27],[22,28,23,28],[22,15,23,15],[22,19,23,19],[22,20,23,20],[22,21,23,21],[22,22,23,22],[22,23,23,23],[22,24,23,24],[20,15,21,15],[20,19,21,19],[20,20,21,20],[20,21,21,21],[20,22,21,22],[24,29,25,29],[20,25,21,25],[20,26,21,26],[20,27,21,27],[20,28,21,28],[22,25,23,25],[22,26,23,26],[4,25,5,25],[4,26,5,26],[4,27,5,27],[4,28,5,28],[4,29,5,29],[20,29,21,29],[14,29,15,29],[22,29,23,29],[16,29,17,29],[14,28,15,28],[6,29,7,29],[18,29,19,29],[10,29,11,29],[12,27,13,27],[12,28,13,28],[12,29,13,29],[8,29,9,29]]}
[{"$f":"申込①!A1","v":"令和5年度NTS近畿ブロック研修会参加申込書（保険申込含む）兼　U15レスリングアジア選手権大会日本代表選考会ﾌﾞﾛｯｸ予選会参加申込書"},null,null,null,null,null,null,null,null,null,null,null,null,null,null,null,null,null,null,null,null,null,null,null,null,null,null,null,null,null,null,null,null,null,null,null,null,null,null,null,null,null,null,"なまえ"]
[{"$f":"申込①!A2","v":"（公財）日本レスリング協会　会長　富山 英明　様"},null,null,null,null,null,null,null,null,null,null,null,null,null,null,null,null,null,null,null,null,null,null,null,"No",2,null,null,null,null,null,null,null,null,null,null,null,null,null,null,null,null,null,"名前",null,"指"]
["No","協会","なまえ（ひらがな）",null,"学年","性別","生年月日",null,"所属","試合","U15","U17",null,"U20",null,"No","協会","なまえ（ひらがな）",null,"学年","性別","生年月日",null,"所属","試合","U15","U17",null,"U20",null,null,null,null,null,null,null,null,null,null,null,null,null,null,5,6,"監督",null,null,null,null,"U-15・F","U-17・F","U-17・G","U-20・F","U-20・G"]
[null,"番号","名前",null,null,null,"注) 2006/10/10の形で入力",null,null,"参加","フリー","フリー","グレコ","フリー","グレコ",null,"番号","名前",null,null,null,"注) 2006/10/10の形で入力",null,null,"参加","フリー","フリー","グレコ","フリー","グレコ",null,null,null,null,null,null,null,null,null,null,null,null,null,3,4,"コーチ",null,"高１","男","○",38,45,45,57,55,"和歌山県"]
["例","JWF23ー","しんぐう","たろう",2,"男","2006-10-10","生","高","○",null,48,null,null,null,null,null,null,null,null,null,null,null,null,null,null,null,null,null,null,null,null,null,null,null,null,null,null,null,null,null,null,null,"学年",13,"高",null,"高２","女",null,41,48,48,61,60,"兵庫県"]
[null,123,"新宮","太朗",null,null,null,null,null,null,null,null,null,null,null,null,null,null,null,null,null,null,null,null,null,null,null,null,null,null,null,null,null,null,null,null,null,null,9,"U-15","U-17","U-20",null,"性別",7,"中",null,"高３",null,null,44,51,51,65,63,"奈良県"]
[21,"JWF23-",null,null,null,null,null,"生",null,null,null,null,null,null,null,31,"JWF23-",null,null,null,null,null,"生",null,null,null,null,null,null,null,null,{"$f":"IF(K7=\"\",\"\",\"U-15F\")","v":""},{"$f":"IF(L7=\"\",\"\",\"U-17F\")","v":""},{"$f":"IF(M7=\"\",\"\",\"U-17G\")","v":""},{"$f":"IF(N7=\"\",\"\",\"U-20F\")","v":""},{"$f":"IF(O7=\"\",\"\",\"U-20G\")","v":""},{"$f":"AF7&AG7&AH7&AI7&AJ7","v":""},{"$f":"SUM(K7:O8)","v":0},null,null,null,null,null,"生年月日",8,"小",null,"中３",null,null,48,55,55,70,67,"大阪府"]
[null,null,null,null,null,null,null,null,null,null,null,null,null,null,null,null,null,null,null,null,null,null,null,null,null,null,null,null,null,null,null,null,null,null,null,null,null,null,{"$f":"IF(B7=\"\",\"\",VLOOKUP(B7,#REF!,$AM$6,FALSE))","v":{"$error":"#REF!"}},{"$f":"IF(AND(G7>=$AR$8,G7<=$AS$8),\"U-15\",\"\")","v":""},{"$f":"IF(AND(G7>=$AR$9,G7<=$AS$9),\"U-17\",\"\")","v":""},{"$f":"IF(AND(G7>=$AR$10,G7<=$AS$10),\"U-20\",\"\")","v":""},"U-15","2008-01-01","2010-12-31","H20",null,"中２",null,null,52,60,60,74,72,"京都府"]
[22,"JWF23-",null,null,null,null,null,"生",null,null,null,null,null,null,null,32,"JWF23-",null,null,null,null,null,"生",null,null,null,null,null,null,null,null,{"$f":"IF(K9=\"\",\"\",\"U-15F\")","v":""},{"$f":"IF(L9=\"\",\"\",\"U-17F\")","v":""},{"$f":"IF(M9=\"\",\"\",\"U-17G\")","v":""},{"$f":"IF(N9=\"\",\"\",\"U-20F\")","v":""},{"$f":"IF(O9=\"\",\"\",\"U-20G\")","v":""},{"$f":"AF9&AG9&AH9&AI9&AJ9","v":""},{"$f":"SUM(K9:O10)","v":0},null,null,null,null,"U-17","2006-01-01","2008-12-31","H18",null,"中１",null,null,57,65,65,79,77,"滋賀県"]
[null,null,null,null,null,null,null,null,null,null,null,null,null,null,null,null,null,null,null,null,null,null,null,null,null,null,null,null,null,null,null,null,null,null,null,null,null,null,{"$f":"IF(B9=\"\",\"\",VLOOKUP(B9,#REF!,$AM$6,FALSE))","v":{"$error":"#REF!"}},{"$f":"IF(AND(G9>=$AR$8,G9<=$AS$8),\"U-15\",\"\")","v":""},{"$f":"IF(AND(G9>=$AR$9,G9<=$AS$9),\"U-17\",\"\")","v":""},{"$f":"IF(AND(G9>=$AR$10,G9<=$AS$10),\"U-20\",\"\")","v":""},"U-20","2003-01-01","2006-12-31","H15",null,"小６",null,null,62,71,71,86,82]
{"$rows_left_out":38}
{"sheet":"List","index":3,"n_rows":47,"n_cols":16,"rows_kept":47,"cut":false,"hidden":false,"merged":[[43,1,46,1]]}
["ID",null,"No","名前","なまえ","都道府県","所属名","しょぞくめい","Grade","階級","学年","抽選","所属","kg","ブロック","略称"]
[null,null,{"$f":"申込①!A7","v":1},{"$f":"IF(申込①!C8=\"\",\"-- --\",申込①!C8&\" \"&申込①!D8)","v":"-- --"},{"$f":"IF(申込①!C8=\"\",\"-- --\",申込①!C7&\" \"&申込①!D7)","v":"-- --"},{"$f":"申込①!$D$32","v":0},{"$f":"申込①!$H$32","v":0},{"$f":"申込①!$H$31","v":0},{"$f":"申込①!AK7","v":""},{"$f":"申込①!AL7","v":0},{"$f":"申込①!E7","v":0},null,{"$f":"申込①!I7","v":0},{"$f":"J2","v":0},{"$f":"申込①!$D$32","v":0},{"$f":"申込①!$K$33","v":0}]
[null,null,{"$f":"申込①!A9","v":2},{"$f":"IF(申込①!C10=\"\",\"-- --\",申込①!C10&\" \"&申込①!D10)","v":"-- --"},{"$f":"IF(申込①!C10=\"\",\"-- --\",申込①!C9&\" \"&申込①!D9)","v":"-- --"},{"$f":"申込①!$D$32","v":0},{"$f":"申込①!$H$32","v":0},{"$f":"申込①!$H$31","v":0},{"$f":"申込①!AK9","v":""},{"$f":"申込①!AL9","v":0},{"$f":"申込①!E9","v":0},null,{"$f":"申込①!I9","v":0},{"$f":"J3","v":0},{"$f":"申込①!$D$32","v":0},{"$f":"申込①!$K$33","v":0}]
[null,null,{"$f":"申込①!A11","v":3},{"$f":"IF(申込①!C12=\"\",\"-- --\",申込①!C12&\" \"&申込①!D12)","v":"-- --"},{"$f":"IF(申込①!C12=\"\",\"-- --\",申込①!C11&\" \"&申込①!D11)","v":"-- --"},{"$f":"申込①!$D$32","v":0},{"$f":"申込①!$H$32","v":0},{"$f":"申込①!$H$31","v":0},{"$f":"申込①!AK11","v":""},{"$f":"申込①!AL11","v":0},{"$f":"申込①!E11","v":0},null,{"$f":"申込①!I11","v":0},0,{"$f":"申込①!$D$32","v":0},{"$f":"申込①!$K$33","v":0}]
[null,null,{"$f":"申込①!A13","v":4},{"$f":"IF(申込①!C14=\"\",\"-- --\",申込①!C14&\" \"&申込①!D14)","v":"-- --"},{"$f":"IF(申込①!C14=\"\",\"-- --\",申込①!C13&\" \"&申込①!D13)","v":"-- --"},{"$f":"申込①!$D$32","v":0},{"$f":"申込①!$H$32","v":0},{"$f":"申込①!$H$31","v":0},{"$f":"申込①!AK13","v":""},{"$f":"申込①!AL13","v":0},{"$f":"申込①!E13","v":0},null,{"$f":"申込①!I13","v":0},0,{"$f":"申込①!$D$32","v":0},{"$f":"申込①!$K$33","v":0}]
[null,null,{"$f":"申込①!A15","v":5},{"$f":"IF(申込①!C16=\"\",\"-- --\",申込①!C16&\" \"&申込①!D16)","v":"-- --"},{"$f":"IF(申込①!C16=\"\",\"-- --\",申込①!C15&\" \"&申込①!D15)","v":"-- --"},{"$f":"申込①!$D$32","v":0},{"$f":"申込①!$H$32","v":0},{"$f":"申込①!$H$31","v":0},{"$f":"申込①!AK15","v":""},{"$f":"申込①!AL15","v":0},{"$f":"申込①!E15","v":0},null,{"$f":"申込①!I15","v":0},0,{"$f":"申込①!$D$32","v":0},{"$f":"申込①!$K$33","v":0}]
[null,null,{"$f":"申込①!A17","v":6},{"$f":"IF(申込①!C18=\"\",\"-- --\",申込①!C18&\" \"&申込①!D18)","v":"-- --"},{"$f":"IF(申込①!C18=\"\",\"-- --\",申込①!C17&\" \"&申込①!D17)","v":"-- --"},{"$f":"申込①!$D$32","v":0},{"$f":"申込①!$H$32","v":0},{"$f":"申込①!$H$31","v":0},{"$f":"申込①!AK17","v":""},{"$f":"申込①!AL17","v":0},{"$f":"申込①!E17","v":0},null,{"$f":"申込①!I17","v":0},{"$f":"J7","v":0},{"$f":"申込①!$D$32","v":0},{"$f":"申込①!$K$33","v":0}]
[null,null,{"$f":"申込①!A19","v":7},{"$f":"IF(申込①!C20=\"\",\"-- --\",申込①!C20&\" \"&申込①!D20)","v":"-- --"},{"$f":"IF(申込①!C20=\"\",\"-- --\",申込①!C19&\" \"&申込①!D19)","v":"-- --"},{"$f":"申込①!$D$32","v":0},{"$f":"申込①!$H$32","v":0},{"$f":"申込①!$H$31","v":0},{"$f":"申込①!AK19","v":""},{"$f":"申込①!AL19","v":0},{"$f":"申込①!E19","v":0},null,{"$f":"申込①!I19","v":0},0,{"$f":"申込①!$D$32","v":0},{"$f":"申込①!$K$33","v":0}]
[null,null,{"$f":"申込①!A21","v":8},{"$f":"IF(申込①!C22=\"\",\"-- --\",申込①!C22&\" \"&申込①!D22)","v":"-- --"},{"$f":"IF(申込①!C22=\"\",\"-- --\",申込①!C21&\" \"&申込①!D21)","v":"-- --"},{"$f":"申込①!$D$32","v":0},{"$f":"申込①!$H$32","v":0},{"$f":"申込①!$H$31","v":0},{"$f":"申込①!AK21","v":""},{"$f":"申込①!AL21","v":0},{"$f":"申込①!E21","v":0},null,{"$f":"申込①!I21","v":0},0,{"$f":"申込①!$D$32","v":0},{"$f":"申込①!$K$33","v":0}]
[null,null,{"$f":"申込①!A23","v":9},{"$f":"IF(申込①!C24=\"\",\"-- --\",申込①!C24&\" \"&申込①!D24)","v":"-- --"},{"$f":"IF(申込①!C24=\"\",\"-- --\",申込①!C23&\" \"&申込①!D23)","v":"-- --"},{"$f":"申込①!$D$32","v":0},{"$f":"申込①!$H$32","v":0},{"$f":"申込①!$H$31","v":0},{"$f":"申込①!AK23","v":""},{"$f":"申込①!AL23","v":0},{"$f":"申込①!E23","v":0},null,{"$f":"申込①!I23","v":0},0,{"$f":"申込①!$D$32","v":0},{"$f":"申込①!$K$33","v":0}]
{"$rows_left_out":38}
{"sheet":"一覧","index":4,"n_rows":46,"n_cols":8,"rows_kept":46,"cut":false,"hidden":false,"merged":[[0,2,0,3],[5,6,5,7],[1,6,1,7]]}
[{"$f":"申込①!$D$32","v":0},null,{"$f":"申込①!$H$32","v":0}]
[null," 以下のように登録しましたので，お知らせします",null,null,null,null,{"$f":"NOW()","v":"2023-10-25T12:49:49.190"}]
[null,null,"合宿参加者全員の名前がありますか？"]
[null,null,"保険の申込書を兼ねているので，生徒や指導者全員の名前が必要です"]
[]
[null,"No","名前","なまえ","学年","試合","階級"]
[null,{"$f":"List!C2","v":1},{"$f":"List!D2","v":"-- --"},{"$f":"List!E2","v":"-- --"},{"$f":"List!K2","v":0},{"$f":"IF(G7=\"\",\"\",\"〇\")","v":""},{"$f":"List!I2","v":""},{"$f":"IF(List!J2=0,\"\",List!J2)","v":""}]
[null,{"$f":"List!C3","v":2},{"$f":"List!D3","v":"-- --"},{"$f":"List!E3","v":"-- --"},{"$f":"List!K3","v":0},{"$f":"IF(G8=\"\",\"\",\"〇\")","v":""},{"$f":"List!I3","v":""},{"$f":"IF(List!J3=0,\"\",List!J3)","v":""}]
[null,{"$f":"List!C4","v":3},{"$f":"List!D4","v":"-- --"},{"$f":"List!E4","v":"-- --"},{"$f":"List!K4","v":0},"",{"$f":"List!I4","v":""},{"$f":"IF(List!J4=0,\"\",List!J4)","v":""}]
[null,{"$f":"List!C5","v":4},{"$f":"List!D5","v":"-- --"},{"$f":"List!E5","v":"-- --"},{"$f":"List!K5","v":0},"",{"$f":"List!I5","v":""},{"$f":"IF(List!J5=0,\"\",List!J5)","v":""}]
{"$rows_left_out":36}